{"text_format":"3","workbook":"xlsx","n_sheets":10,"sheets":["Présentation","Simulateur","Données Projet PAVILLON","PAVILLON Saison chauffe","PAVILLON journée Type","Données Projet Salle de Classe","Salle de Classe Journée type","Donnees Climatiques Hiver","Systèmes Ventilation","Evolution Journalière Biarritz"],"not_rendered":{"images":5,"macros":1,"external_links":1,"defined_names":11,"comments":6},"read":"whole","date_system":"1900"}

{"sheet":"Présentation","index":0,"n_rows":37,"n_cols":7,"rows_kept":37,"merged":[[2,6,2,11],[3,6,3,11]]}
[]
[]
[{"$nulls":6},"Systèmes de Ventilation"]
[{"$nulls":6},"Améliorations énergétiques"]
{"$rows_empty":19}
[{"$nulls":3},"Doc France Air"]
[]
[]
["Nota :","Pour assurer une bonne lisibilité, veuillez respecter une"]
[null,"résolution d'écran MINIMUM : 1280 * 1024"]
{"$rows_left_out":10}
{"sheet":"Simulateur","index":1,"n_rows":18,"n_cols":11,"rows_kept":18,"merged":[[1,0,1,10]]}
[]
["SIMULATION : CALCUL DE L'EFFICACITE D'UN ECHANGEUR\nEQUIPANT UNE VMC DOUBLE FLUX STATIQUE"]
[]
[{"$nulls":4},"Te1 = TINTERIEURE                         =",{"v":20,"d":"20.00"},"°C",null,"Te1 = TINTERIEURE                         =",{"v":18,"d":"18.00"},"°C"]
[{"$nulls":4},"Te2 = TEXTERIEURE                  =",{"v":-5,"d":"-5.00"},"°C",null,"Te2 = TEXTERIEURE                  =",{"v":-7,"d":"-7.00"},"°C"]
[{"$nulls":4},"Efficacite ECHANGEUR  =",{"v":0.9,"d":"0.90"},null,null,"Efficacite ECHANGEUR  =",{"v":0.6,"d":"0.60"}]
[]
[{"$nulls":4},"Ts2 = TSOUFFLAGE =",{"$f":"F6*(F4-F5)+F5","v":{"v":17.5,"d":"17.50"}},"°C",null,"Ts2 = TSOUFFLAGE =",{"$f":"J6*(J4-J5)+J5","v":{"v":8,"d":"8.00"}},"°C"]
[]
[{"$nulls":4},"P RECUPEREE AVEC ECHANGEUR   =",{"$f":"0.34*1*(F8-F5)","v":7.65},"W/(m3/h d'air)",null,"P RECUPEREE AVEC ECHANGEUR   =",{"$f":"0.34*1*(J8-J5)","v":{"v":5.1000000000000005,"d":"5.10"}},"W/(m3/h d'air)"]
{"$rows_left_out":9}
{"sheet":"Données Projet PAVILLON","index":2,"n_rows":48,"n_cols":16,"rows_kept":48,"merged":[[0,0,0,790],[8,5,8,7],[9,5,9,7],[10,1,10,3],[10,5,10,7],[10,8,10,10],[12,1,12,3],[12,5,12,7],[14,1,14,8],[22,4,22,7],[22,10,22,13],[23,4,23,7],[23,10,23,13],[24,4,24,5],[24,10,24,11],[25,4,25,5],[25,6,25,7],[25,10,25,11],[25,12,25,13],[26,4,26,5],[26,6,26,7],[26,10,26,11],[27,4,27,5],[27,10,27,11],[29,4,29,5],[29,6,29,7],[29,10,29,11],[29,12,29,13],[30,1,30,3],[30,4,30,5],[30,6,30,7],[30,10,30,11],[30,12,30,13],[32,1,32,3],[34,4,34,5],[34,6,34,9],[34,10,34,11],[34,12,34,13],[36,1,36,3],[41,5,41,9],[41,11,41,15],[42,1,42,3],[42,5,42,6],[42,7,42,8],[42,11,42,12],[42,13,42,14],[42,22,42,23],[43,1,43,4],[43,5,43,6],[43,7,43,8],[43,11,43,12],[43,13,43,14],[44,1,44,4],[44,5,44,6],[44,7,44,8],[44,11,44,12],[44,13,44,14],[45,1,45,4],[45,5,45,6],[45,7,45,8],[45,11,45,12],[45,13,45,14],[46,1,46,4],[46,5,46,6],[46,7,46,8],[46,11,46,12],[46,13,46,14],[47,1,47,4],[47,5,47,6],[47,7,47,8],[47,11,47,12],[47,13,47,14],[52,10,52,11]]}
["IDENTIFICATION DU PROJET - Pavillon"]
[]
[]
[]
[]
["Données de Base du Projet"]
[]
[]
[null,"Département :",{"$nulls":3},"65 - Hautes-Pyrénées",null,null,"N° :",{"$f":"LOOKUP(F9,'Donnees Climatiques Hiver'!B4:CS5)","v":65}]
[null,"Situation :",{"$nulls":3},"Alt. entre 0 et 200 m",null,null,"Suivant EN 12831"]
{"$rows_left_out":39}
{"sheet":"PAVILLON Saison chauffe","index":3,"n_rows":50,"n_cols":20,"rows_kept":50,"merged":[[0,0,0,17],[2,1,2,2],[2,5,2,7],[2,8,2,9],[2,12,2,17],[2,20,2,25],[3,4,4,4],[3,5,4,6],[3,7,4,7],[3,14,3,15],[3,16,3,17],[3,20,3,21],[3,23,3,24],[4,0,7,0],[4,20,4,21],[4,23,4,24],[5,4,6,4],[5,5,6,6],[5,7,6,7],[5,20,5,21],[5,23,5,24],[7,4,7,7],[8,0,14,0],[9,5,9,7],[9,8,9,9],[9,12,9,15],[10,4,11,4],[10,5,10,6],[10,8,11,8],[10,9,11,9],[10,12,11,12],[10,13,10,14],[11,5,11,6],[11,13,11,14],[12,4,14,4],[12,5,12,6],[12,8,13,8],[12,9,13,9],[12,12,13,12],[12,13,12,14],[13,5,13,6],[13,13,13,14],[14,5,14,6],[16,1,16,19],[17,1,17,2],[18,1,18,2],[19,1,19,2],[20,1,20,2],[21,1,21,2],[22,1,22,2],[23,1,23,2],[26,0,33,0],[38,0,47,0]]}
["Système Double Flux et Consommations Energétiques - Saison de chauffe : 230 jours et Renouvellement d'Air à Vitesse Constante"]
[]
[null,"DONNEES DE L'ETUDE",{"$nulls":3},"Caractéristiques des Moteurs\ndu système de ventilation",null,null,"Consommations et coûts de fonctionnement des Ventilateurs",{"$nulls":3},"Débit d'Infiltration d'air neuf :   Vinf,i"]
[null,"Cout moyen du kWh electrique",{"$f":"'Données Projet PAVILLON'!F37","v":{"v":0.1,"d":"0.10 €"}},null,{"$f":"'Données Projet PAVILLON'!E24:H24","v":"VMC Simple Flux Autoréglable"},"Puissance consommée\ndu Ventilateur\nAVANT modifications",null,{"$f":"'Données Projet PAVILLON'!E27","v":{"v":30,"d":"30.00 W"}},"Consommation ventilateur en kWh",{"$f":"24*230*H4*0.001","v":{"v":165.6,"d":"165.60 kWh"}},null,null,"Surface\nPavillon",{"$f":"'Données Projet PAVILLON'!F17","v":{"v":200,"d":"200.00 m²"}},{"$f":"'Données Projet PAVILLON'!E24","v":"VMC Simple Flux Autoréglable"},null,{"$f":"'Données Projet PAVILLON'!K24","v":"VMC Simple Flux Autoréglable"}]
[{"$f":"'Données Projet PAVILLON'!E24","v":"VMC Simple Flux Autoréglable"},"Débit air ENTRANT\n(fonction du logement et du système de ventilation)",{"$f":"'Données Projet PAVILLON'!E26","v":{"v":120,"d":"120 m3/h"}},{"$nulls":5},"Cout de fonctionnement ventlilateur en €",{"$f":"(J4)*C4","v":{"v":16.56,"d":"16.56 €"}},null,null,"Volume du\nbatiment",{"$f":"N4*N7","v":{"v":500,"d":"500.00 m3"}},"n50 =",{"$f":"1.8*P6*(3/2)","v":{"v":2.7,"d":"2.70 h^-1"}},"n50 =",{"$f":"1.8*R6*(3/2)","v":{"v":2.7,"d":"2.70 h^-1"}}]
[null,"Intermittence",{"$f":"'Données Projet PAVILLON'!E31","v":0.95},null,{"$f":"'Données Projet PAVILLON'!K24","v":"VMC Simple Flux Autoréglable"},"Puissance consommée\ndes Ventilateurs\nAPRES modifications",null,{"$f":"'Données Projet PAVILLON'!K27","v":{"v":30,"d":"30.00 W"}},"Consommation des ventilateurs en kWh",{"$f":"24*230*H6*0.001","v":{"v":165.6,"d":"165.60 kWh"}},null,null,"Nb de\nniveaux",{"$f":"'Données Projet PAVILLON'!F19","v":2},"Degré Etanchéité :",1,"Degré Etanchéité :",1]
[null,"Température intérieure de confort imposée",{"$f":"'Données Projet PAVILLON'!E28","v":{"v":18,"d":"18.00 °C"}},{"$nulls":5},"Cout de fonctionnement ventlilateurs en €",{"$f":"(J6)*C4","v":{"v":16.56,"d":"16.56 €"}},null,null,"HSP",{"$f":"'Données Projet PAVILLON'!F18","v":{"v":2.5,"d":"2.50 m"}},"Vinf,i =",{"$f":"2*P5*$N$5*0.03","v":{"v":81,"d":"81 m3/h"}},"Vinf,i =",{"$f":"2*$R$5*$N$5*0.03","v":{"v":81,"d":"81 m3/h"}}]
[null,"Rendement global système chauffage",{"$f":"'Données Projet PAVILLON'!G31","v":0.9},null,"Fonctionnement Ventilateur(s) 24h/24h - \n230 jours/an : saison de chauffe"]
[{"$f":"'Données Projet PAVILLON'!K24","v":"VMC Simple Flux Autoréglable"},"Débit air ENTRANT\n(fonction du logement et du système de ventilation)",{"$f":"'Données Projet PAVILLON'!K26","v":{"v":120,"d":"120 m3/h"}}]
[null,"Température intérieure de confort souhaitée",{"$f":"'Données Projet PAVILLON'!K28","v":{"v":18,"d":"18.00 °C"}},null,null,"Coûts et gains réalisés",null,null,"Consommations Energetiques",{"$nulls":3},"Coûts Energétiques des Infiltrations d'Air"]
{"$rows_left_out":41}
{"sheet":"PAVILLON journée Type","index":4,"n_rows":56,"n_cols":26,"rows_kept":56,"merged":[[0,0,0,17],[3,1,3,2],[3,5,3,7],[3,8,3,9],[3,12,3,17],[4,4,5,4],[4,5,5,6],[4,7,5,7],[4,12,4,13],[4,15,4,16],[5,0,8,0],[5,12,5,13],[5,15,5,16],[6,4,7,4],[6,5,7,6],[6,7,7,7],[6,12,6,13],[6,15,6,16],[8,4,8,7],[9,0,15,0],[10,5,10,7],[10,8,10,9],[10,12,10,17],[11,4,12,4],[11,5,11,6],[11,8,12,8],[11,9,12,9],[11,14,11,15],[11,16,11,17],[12,5,12,6],[13,4,15,4],[13,5,13,6],[13,8,14,8],[13,9,14,9],[14,5,14,6],[15,5,15,6],[16,12,16,15],[17,12,18,12],[17,13,17,14],[18,13,18,14],[19,12,20,12],[19,13,19,14],[20,13,20,14],[22,1,22,25],[23,1,23,2],[24,1,24,2],[25,1,25,2],[26,1,26,2],[27,1,27,2],[28,1,28,2],[29,1,29,2],[32,0,39,0],[44,0,53,0]]}
["Système Double Flux et Consommations Energétiques - Journée Type de chauffage - Régulation de la Vitesse des Ventilateurs"]
[]
[]
[null,"Données de l'étude",{"$nulls":3},"Caractéristiques des moteurs\ndu système de ventilation",null,null,"Consommations et Coûts de Fonctionnement des Ventilateurs",{"$nulls":3},"Scénario de fonctionnement des ventilateurs - Variations de vitesses"]
[null,"Cout moyen du kWh electrique",{"$f":"'Données Projet PAVILLON'!F37","v":{"v":0.1,"d":"0.10 €"}},null,{"$f":"'Données Projet PAVILLON'!E24","v":"VMC Simple Flux Autoréglable"},"Puissance consommée du Ventilateur\nAVANT modifications",null,{"$f":"'Données Projet PAVILLON'!E27","v":{"v":30,"d":"30.00 W"}},"Consommation ventilateur kWh/j",{"$f":"24*H5*0.001","v":{"v":0.72,"d":"0.72 kWh/j"}},null,null,"Vitesse de rotation du Ventilateur\n100% de charge (maxi)",null,{"v":500,"d":"500 tr/min"},"Vitesse de rotation du Ventilateur mode régulation :",null,{"v":500,"d":"500 tr/min"}]
[{"$f":"'Données Projet PAVILLON'!E24","v":"VMC Simple Flux Autoréglable"},"Débit air ENTRANT 100% de charge\n(fonction du logement)",{"$f":"'Données Projet PAVILLON'!E26","v":{"v":120,"d":"120 m3/h"}},{"$nulls":5},"Coût fonctionnement ventlilateur en €/j",{"$f":"24*H5*0.001*$C$5","v":{"v":0.072,"d":"0.07 €/j"}},null,null,"Temps de fonctionnement du ou des ventilateur par jour 100% de charge :",null,{"v":20,"d":"20.00 h"},"Temps de fonctionnement du ou des ventilateurs phase réduite :",null,{"v":4,"d":"4.00 h"}]
[null,"Intermittence",{"$f":"'Données Projet PAVILLON'!E31","v":0.95},null,{"$f":"'Données Projet PAVILLON'!K24","v":"VMC Simple Flux Autoréglable"},"Puissance consommée des Ventilateur\nAPRES modifications",null,{"$f":"'Données Projet PAVILLON'!K27","v":{"v":30,"d":"30.00 W"}},"Consommation ventilateurs kWh/j",{"$f":"O6*H7*0.001+R6*(H7/(O5/R5)^3)*0.001","v":{"v":0.72,"d":"0.72 kWh/j"}},null,null,"Nb de jours d'utilisation\ndes locaux/an : Durée ",null,{"v":1,"d":"1 jour(s)"}]
[null,"Température intérieure de confort imposée",{"$f":"'Données Projet PAVILLON'!E28","v":{"v":18,"d":"18.00 °C"}},{"$nulls":5},"Coût fonctionnement ventlilateurs en €/j",{"$f":"J7*$C$5","v":{"v":0.072,"d":"0.07 €/j"}}]
[null,"Rendement global système chauffage",{"$f":"'Données Projet PAVILLON'!G31","v":0.9},null,"Fonctionnement Ventilateur(s) suivant ligne de temps"]
[{"$f":"'Données Projet PAVILLON'!K24","v":"VMC Simple Flux Autoréglable"},"Débit air ENTRANT 100% de charge\n(fonction du logement)",{"$f":"'Données Projet PAVILLON'!K26","v":{"v":120,"d":"120 m3/h"}}]
{"$rows_left_out":47}
{"sheet":"Données Projet Salle de Classe","index":5,"n_rows":48,"n_cols":13,"rows_kept":48,"merged":[[0,0,0,16],[8,5,8,7],[9,5,9,7],[10,1,10,3],[10,5,10,7],[10,8,10,10],[12,1,12,3],[12,5,12,7],[14,1,14,8],[23,4,23,7],[23,10,23,13],[24,4,24,7],[24,10,24,13],[25,10,25,11],[26,4,26,5],[26,6,26,7],[26,10,26,11],[26,12,26,13],[27,4,27,5],[27,6,27,7],[27,10,27,11],[28,4,28,5],[28,10,28,11],[29,4,29,5],[29,10,29,11],[30,17,30,21],[31,4,31,5],[31,6,31,7],[31,10,31,11],[31,12,31,13],[31,17,31,18],[31,19,31,20],[32,1,32,3],[32,4,32,5],[32,6,32,7],[32,10,32,11],[32,12,32,13],[32,17,32,18],[32,19,32,20],[33,1,33,3],[35,4,35,5],[35,6,35,9],[35,10,35,11],[35,12,35,13],[35,17,35,18],[35,19,35,20],[36,1,36,3],[36,17,36,18],[36,19,36,20],[41,5,41,9],[42,1,42,3],[42,5,42,6],[42,7,42,8],[42,22,42,23],[43,1,43,4],[43,5,43,6],[43,7,43,8],[44,1,44,4],[44,5,44,6],[44,7,44,8],[45,1,45,4],[45,5,45,6],[45,7,45,8],[46,1,46,4],[46,5,46,6],[46,7,46,8],[47,1,47,4],[47,5,47,6],[47,7,47,8],[52,10,52,11]]}
["IDENTIFICATION DU PROJET - Salle de Classe"]
[]
[]
[]
[]
["Données de Base du Projet"]
[]
[]
[null,"Département :",{"$nulls":3},"40 - Landes",null,null,"N° :",{"$f":"LOOKUP(F9,'Donnees Climatiques Hiver'!B4:CS5)","v":40}]
[null,"Situation :",{"$nulls":3},"Alt. entre 0 et 200 m",null,null,"Suivant EN 12831"]
{"$rows_left_out":39}
{"sheet":"Salle de Classe Journée type","index":6,"n_rows":56,"n_cols":26,"rows_kept":56,"merged":[[0,0,0,17],[3,1,3,2],[3,5,3,7],[3,8,3,9],[3,12,3,17],[4,4,5,4],[4,5,5,6],[4,7,5,7],[4,12,4,13],[4,15,4,16],[5,0,8,0],[5,12,5,13],[5,15,5,16],[6,4,7,4],[6,5,7,6],[6,7,7,7],[6,12,6,13],[6,15,6,16],[8,4,8,7],[9,0,15,0],[10,5,10,7],[10,8,10,9],[10,12,10,17],[11,4,12,4],[11,5,11,6],[11,8,12,8],[11,9,12,9],[11,14,11,15],[11,16,11,17],[12,5,12,6],[13,4,15,4],[13,5,13,6],[13,8,14,8],[13,9,14,9],[14,5,14,6],[15,5,15,6],[16,12,16,15],[17,12,18,12],[17,13,17,14],[18,13,18,14],[19,12,20,12],[19,13,19,14],[20,13,20,14],[20,16,20,17],[22,1,22,25],[23,1,23,2],[24,1,24,2],[25,1,25,2],[26,1,26,2],[27,1,27,2],[28,1,28,2],[29,1,29,2],[32,0,39,0],[44,0,53,0]]}
["Système Double Flux et Consommations Energétiques - Journée Type de chauffage - Régulation Occupation et Innocupation"]
[]
[]
[null,"Données de l'étude",{"$nulls":3},"Caractéristiques des moteurs\ndu système de ventilation",null,null,"Consommations et Coûts de Fonctionnement des Ventilateurs",{"$nulls":3},"Scénario de fonctionnement des ventilateurs - Variations de vitesses"]
[null,"Cout moyen du kWh electrique",{"$f":"'Données Projet Salle de Classe'!F37","v":{"v":0.1,"d":"0.10 €"}},null,{"$f":"'Données Projet Salle de Classe'!E25","v":"VMC Simple Flux Autoréglable"},"Puissance consommée du Ventilateur\nAVANT modifications",null,{"$f":"'Données Projet Salle de Classe'!E28","v":{"v":150,"d":"150.00 W"}},"Consommation du ventilateur kWh/j",{"$f":"24*H5*0.001","v":{"v":3.6,"d":"3.60 kWh/j"}},null,null,"Vitesse de rotation du Ventilateur\n100% de charge (maxi)",null,{"v":600,"d":"600 tr/min"},"Vitesse de rotation du Ventilateur mode régulation :",null,{"v":600,"d":"600 tr/min"}]
[{"$f":"'Données Projet Salle de Classe'!E25","v":"VMC Simple Flux Autoréglable"},"Débit air ENTRANT 100% de charge\n(fonction du logement)",{"$f":"'Données Projet Salle de Classe'!E27","v":{"v":600,"d":"600 m3/h"}},{"$nulls":5},"Coût de fonctionnement ventlilateur en €/j",{"$f":"24*H5*0.001*$C$5","v":{"v":0.36000000000000004,"d":"0.36 €/j"}},null,null,"Temps de fonctionnement du ou des ventilateur par jour 100% de charge :",null,{"v":12,"d":"12.00 h"},"Temps de fonctionnement du ou des ventilateurs phase réduite :",null,{"$f":"IF(R7>0,0,24-O6)","v":{"v":12,"d":"12.00 h"}}]
[null,"Intermittence",{"$f":"'Données Projet Salle de Classe'!E33","v":0.9},null,{"$f":"'Données Projet Salle de Classe'!K25","v":"VMC Simple Flux Autoréglable"},"Puissance consommée des Ventilateur\nAPRES modifications",null,{"$f":"'Données Projet Salle de Classe'!K28","v":{"v":150,"d":"150.00 W"}},"Consommation des ventilateurs kWh/j",{"$f":"O6*H7*0.001+R6*(H7/(O5/R5)^3)*0.001","v":{"v":3.6,"d":"3.600 kWh/j"}},null,null,"Nb de jours d'utilisation\ndes locaux/an : Durée ",null,{"v":1,"d":"1 jour(s)"},"Temps d'arrêt du ou des ventilateurs :",null,{"v":0,"d":"0.00 h"}]
[null,"Température intérieure de confort imposée",{"$f":"'Données Projet Salle de Classe'!E30","v":{"v":19,"d":"19.00 °C"}},{"$nulls":5},"Coût de fonctionnement ventlilateurs en €/j",{"$f":"J7*$C$5","v":{"v":0.36000000000000004,"d":"0.360 €/j"}}]
[null,"Rendement global système chauffage",{"$f":"'Données Projet Salle de Classe'!G33","v":0.95},null,"Fonctionnement Ventilateur(s) suivant ligne de temps"]
[{"$f":"'Données Projet Salle de Classe'!K25","v":"VMC Simple Flux Autoréglable"},"Débit air ENTRANT 100% de charge\n(fonction du logement)",{"$f":"'Données Projet Salle de Classe'!K27","v":{"v":600,"d":"600 m3/h"}}]
{"$rows_left_out":47}
{"sheet":"Donnees Climatiques Hiver","index":7,"n_rows":20,"n_cols":97,"rows_kept":20,"hidden":true,"merged":[[1,0,1,96]]}
[]
["Données Climatiques HIVER _  EN 12831"]
[]
["Département","01 - Ain","02 - Aisne","03 - Allier","04 - Alpes de haute provence","05 - Hautes-Alpes","06 - Alpes maritimes","07 - Ardèche","08 - Ardennes","09 - Ariège","10 - Aube","11 - Aude","12 - Aveyron","13 - Bouches-du-Rhône","14 - Calvados","15 - Cantal","16 - Charente","17 - Charente-Maritime","18 - Cher","19 - Corrèze","2A_B - Corse","21 - Côte-d'Or","22 - Côtes-d'Armor","23 - Creuse","24 - Dordogne","25 - Doubs","26 - Drôme","27 - Eure","28 - Eure-et-Loire","29 - Finistère","30 - Gard","31 - Haute-Garonne","32 - Gers","33 - Gironde","34 - Hérault","35 - Ille-et-Vilaine","36 - Indre","37 - Indre-et-Loire","38 - Isère","39 - Jura","40 - Landes","41 - Loir-et-Cher","42 - Loire","43 - Haute-Loire","44 - Loire Atlantique","45 - Loiret","46 - Lot","47 - Lot-et-Garonne","48 - Lozère","49 - Maine-et-Loire","50 - Manche","51 - Marne","52 - Haute-Marne","53 - Mayenne","54 - Meurthe-et-Moselle","55 - Meuse","56 - Morbihan","57 - Moselle","58 - Nièvre","59 - Nord","60 - Oise","61 - Orne","62 - Pas-de-Calais","63 - Puy-de-Dôme","64 - Pyrénées Atlantiques","65 - Hautes-Pyrénées","66 - Pyrénées-orientales","67 - Bas-Rhin","68 - Haut-Rhin","69 - Rhône","70 - Haute-Saône","71 - Saône-et-Loire","72 - Sarthe","73 - Savoie","74 - Haute-Savoie","75 - Paris","76 - Seine-Maritime","77 - Seine-et-Marne","78 - Yvelines","79 - Deux-Sèvres","80 - Somme","81 - Tarn","82 - Tarn-et-Garonne","83 - Var","84 - Vaucluse","85 - Vendée","86 - Vienne","87 - Haute-Vienne","88 - Vosges","89 - Yonne","90 - Territoire-de-Belfort","91 - Essone","92 - Hauts-de-Seine","93 - Seine-Saint-Denis","94 - Val-de-Marne","95 - Val-d'Oise","Donnée Utilisateur"]
["-",1,2,3,4,5,6,7,8,9,10,11,12,13,14,15,16,17,18,19,20,21,22,23,24,25,26,27,28,29,30,31,32,33,34,35,36,37,38,39,40,41,42,43,44,45,46,47,48,49,50,51,52,53,54,55,56,57,58,59,60,61,62,63,64,65,66,67,68,69,70,71,72,73,74,75,76,77,78,79,80,81,82,83,84,85,86,87,88,89,90,91,92,93,94,95,96]
["Iles","-","-","-","-","-",0,"-","-","-","-",-2,"-",-3,-5,"-","-",-2,"-","-","-","-",-2,"-","-","-","-","-","-",-2,-3,"-","-",-2,-3,-2,"-","-","-","-",-2,"-","-","-",-2,"-","-","-","-","-",-2,"-","-","-","-","-",-2,"-","-",-7,"-","-",-7,"-",-3,"-",-2,"-","-","-","-","-","-","-","-","-",-5,"-","-","-",-7,"-","-",0,"-",-2,"-","-","-","-","-","-","-","-","-","-",-5]
["côte < 25 km","-","-","-","-","-",-2,"-","-","-","-",-4,"-",-5,-7,"-","-",-4,"-","-",-2,"-",-4,"-","-","-","-","-","-",-4,-3,"-","-",-4,-3,-4,"-","-","-","-",-4,"-","-","-",-4,"-","-","-","-","-",-2,"-","-","-","-","-",-4,"-","-",-9,"-","-",-9,"-",-4,"-",-4,"-","-","-","-","-","-","-","-","-",-7,"-","-","-",-8,"-","-",-2,"-",-4,"-","-","-","-","-","-","-","-","-","-",{"$f":"CS6","v":-5}]
["Alt. entre 0 et 200 m",-10,-7,-8,-8,-10,-5,-6,-10,-5,-10,-5,-8,-5,-7,-8,-5,-5,-7,-8,-2,-10,-4,-8,-5,-12,-6,-7,-7,-4,-5,-5,-5,-5,-5,-4,-7,-7,-10,-10,-5,-7,-10,-8,-5,-7,-6,-5,-8,-7,-4,-10,-12,-7,-15,-12,-4,-15,-10,-9,-7,-7,-9,-8,-5,-5,-5,-15,-15,-10,-10,-10,-7,-10,-10,-5,-7,-7,-7,-7,-9,-5,-5,-5,-6,-5,-7,-8,-15,-10,-15,-7,-7,-7,-7,-7,{"$f":"CS7","v":-5}]
["Alt. entre 201 et 400 m",-11,-8,-9,-9,-11,-6,-7,-11,-6,-11,-6,-9,-6,-8,-9,-6,"-",-8,-9,-3,-11,-5,-9,-6,-13,-7,-8,-8,-5,-6,-6,-6,"-",-6,"-",-8,"-",-11,-11,-6,-8,-11,-9,"-",-8,-7,-6,-9,-8,-5,-11,-13,-8,-15,-13,-5,-15,-11,-10,-8,-8,-10,-9,-6,-6,-6,-15,-15,-11,-11,-11,-8,-11,-11,"-",-8,-8,"-",-8,-10,-6,-6,-6,-7,-6,-8,-9,-15,-11,-15,"-","-","-","-","-",-5]
["Alt. entre 401 et 500 m",-12,"-",-10,-10,-12,-7,-8,-12,-7,"-",-7,-10,-7,"-",-10,"-","-",-9,-10,-4,-12,"-",-10,-7,-14,-8,"-","-","-",-7,-7,"-","-",-7,"-",-9,"-",-12,-12,"-","-",-12,-10,"-","-",-8,"-",-10,"-","-","-",-14,"-",-16,-14,"-",-16,-12,"-","-",-9,"-",-10,-7,-7,-7,-16,-16,-12,-12,-12,"-",-12,-12,"-","-","-","-","-","-",-7,"-",-7,-8,"-","-",-10,-16,-12,-16,"-","-","-","-","-",-5]
{"$rows_left_out":11}
{"sheet":"Systèmes Ventilation","index":8,"n_rows":19,"n_cols":3,"rows_kept":19,"hidden":true}
[]
[]
[null,"Système de Ventilation disponible"]
[]
[null,"VNC Naturelle"]
[null,"VMC Simple Flux Autoréglable"]
[null,"VMC Simple Flux HygroA"]
[null,"VMC Simple Flux HygroB"]
[null,"VMC Double Flux","Efficacité DF"]
[null,null,0]
{"$rows_left_out":10}
{"sheet":"Evolution Journalière Biarritz","index":9,"n_rows":218,"n_cols":33,"rows_kept":218,"merged":[[0,0,0,29],[2,3,2,5]]}
["Evolution de la température extérieure - Evaluation des Degrés jours pour une Température de consigne fixée sur l'année civile 2008 de chauffe"]
["Biarritz :",{"$nulls":4},"a",0,3,10,21,34,47,58,68,76,82,92,96,99,100,98,93,84,71,56,39,23,11,3,{"$nulls":3},"DJx"]
[null,null,{"$f":"MAX(C5:C216)","v":{"v":27,"d":"27.0"}},{"$nulls":3},1,2,3,4,5,6,7,8,9,10,11,12,13,14,15,16,17,18,19,20,21,22,23,null,"Consigne",null,"01/01 au 31/12"]
["Jour","Mois","t°max","dt",{"$nulls":25},"D°Heures",{"v":19,"d":"19°C"},null,{"$f":"AE218","v":{"v":1731.9876666666667,"d":"1732"}}]
["2000-01-01",{"$f":"A5","v":"2000-01-01"},10.200000000000001,13.8,null,null,{"$f":"$C5-(G$2*$D5/100)","v":{"v":10.200000000000001,"d":"10.2"}},{"v":9.786000000000001,"d":"9.8"},{"v":8.82,"d":"8.8"},{"v":7.302000000000001,"d":"7.3"},{"v":5.508000000000001,"d":"5.5"},{"v":3.7140000000000004,"d":"3.7"},{"v":2.1959999999999997,"d":"2.2"},{"v":0.8160000000000007,"d":"0.8"},{"v":-0.2879999999999985,"d":"-0.3"},{"v":-1.1159999999999997,"d":"-1.1"},{"v":-2.4960000000000004,"d":"-2.5"},{"v":-3.048,"d":"-3.0"},{"v":-3.4619999999999997,"d":"-3.5"},{"v":-3.5999999999999996,"d":"-3.6"},{"v":-3.324,"d":"-3.3"},{"v":-2.6340000000000003,"d":"-2.6"},{"$f":"$C5-(W$2*$D5/100)","v":{"v":-1.3919999999999995,"d":"-1.4"}},{"v":0.402000000000001,"d":"0.4"},{"v":2.4720000000000004,"d":"2.5"},{"v":4.8180000000000005,"d":"4.8"},{"v":7.026000000000001,"d":"7.0"},{"v":8.682,"d":"8.7"},{"v":9.786000000000001,"d":"9.8"},{"$f":"(AE$4*23)-SUM($G5:$AC5)","v":{"v":376.832,"d":"376.8"}}]
["2000-01-02","2000-01-02",12.6,14.7,null,null,12.6,{"v":12.158999999999999,"d":"12.2"},{"v":11.129999999999999,"d":"11.1"},{"v":9.513,"d":"9.5"},{"v":7.602,"d":"7.6"},{"v":5.691,"d":"5.7"},{"v":4.074,"d":"4.1"},{"v":2.604000000000001,"d":"2.6"},{"v":1.427999999999999,"d":"1.4"},{"v":0.5460000000000012,"d":"0.5"},{"v":-0.9239999999999995,"d":"-0.9"},{"v":-1.5119999999999987,"d":"-1.5"},{"v":-1.9529999999999994,"d":"-2.0"},{"v":-2.0999999999999996,"d":"-2.1"},{"v":-1.8059999999999992,"d":"-1.8"},{"v":-1.0709999999999997,"d":"-1.1"},{"v":0.25200000000000067,"d":"0.3"},{"v":2.1629999999999985,"d":"2.2"},{"v":4.368,"d":"4.4"},{"v":6.867,"d":"6.9"},{"v":9.219,"d":"9.2"},{"v":10.983,"d":"11.0"},{"v":12.158999999999999,"d":"12.2"},{"v":333.00800000000004,"d":"333.0"}]
["2000-01-03","2000-01-03",12.399999999999999,3.8,null,null,{"v":12.399999999999999,"d":"12.4"},{"v":12.285999999999998,"d":"12.3"},{"v":12.019999999999998,"d":"12.0"},{"v":11.601999999999999,"d":"11.6"},{"v":11.107999999999999,"d":"11.1"},{"v":10.613999999999999,"d":"10.6"},{"v":10.195999999999998,"d":"10.2"},{"v":9.815999999999999,"d":"9.8"},{"v":9.511999999999999,"d":"9.5"},{"v":9.283999999999999,"d":"9.3"},{"v":8.904,"d":"8.9"},{"v":8.751999999999999,"d":"8.8"},{"v":8.637999999999998,"d":"8.6"},{"v":8.599999999999998,"d":"8.6"},{"v":8.675999999999998,"d":"8.7"},{"v":8.866,"d":"8.9"},{"v":9.207999999999998,"d":"9.2"},{"v":9.701999999999998,"d":"9.7"},{"v":10.271999999999998,"d":"10.3"},{"v":10.918,"d":"10.9"},{"v":11.525999999999998,"d":"11.5"},{"v":11.982,"d":"12.0"},{"v":12.285999999999998,"d":"12.3"},{"v":199.83200000000005,"d":"199.8"}]
["2000-01-04","2000-01-04",13.3,6.6,null,null,13.3,{"v":13.102,"d":"13.1"},{"v":12.64,"d":"12.6"},{"v":11.914000000000001,"d":"11.9"},{"v":11.056000000000001,"d":"11.1"},{"v":10.198,"d":"10.2"},{"v":9.472000000000001,"d":"9.5"},{"v":8.812000000000001,"d":"8.8"},{"v":8.284,"d":"8.3"},{"v":7.888000000000002,"d":"7.9"},{"v":7.2280000000000015,"d":"7.2"},{"v":6.964000000000001,"d":"7.0"},{"v":6.766000000000001,"d":"6.8"},{"v":6.700000000000001,"d":"6.7"},{"v":6.832000000000001,"d":"6.8"},{"v":7.162000000000001,"d":"7.2"},{"v":7.756000000000001,"d":"7.8"},{"v":8.614,"d":"8.6"},{"v":9.604000000000001,"d":"9.6"},{"v":10.726,"d":"10.7"},{"v":11.782,"d":"11.8"},{"v":12.574000000000002,"d":"12.6"},{"v":13.102,"d":"13.1"},{"v":214.52399999999992,"d":"214.5"}]
["2000-01-05","2000-01-05",16,8.5,null,null,{"v":16,"d":"16.0"},{"v":15.745,"d":"15.7"},{"v":15.15,"d":"15.2"},{"v":14.215,"d":"14.2"},{"v":13.11,"d":"13.1"},{"v":12.004999999999999,"d":"12.0"},{"v":11.07,"d":"11.1"},{"v":10.219999999999999,"d":"10.2"},{"v":9.54,"d":"9.5"},{"v":9.030000000000001,"d":"9.0"},{"v":8.18,"d":"8.2"},{"v":7.84,"d":"7.8"},{"v":7.585000000000001,"d":"7.6"},7.5,{"v":7.67,"d":"7.7"},{"v":8.094999999999999,"d":"8.1"},{"v":8.86,"d":"8.9"},{"v":9.965,"d":"10.0"},{"v":11.24,"d":"11.2"},{"v":12.685,"d":"12.7"},{"v":14.045,"d":"14.0"},{"v":15.065,"d":"15.1"},{"v":15.745,"d":"15.7"},{"v":176.44,"d":"176.4"}]
["2000-01-06","2000-01-06",16.6,3.8,null,null,16.6,{"v":16.486,"d":"16.5"},{"v":16.220000000000002,"d":"16.2"},{"v":15.802000000000001,"d":"15.8"},{"v":15.308000000000002,"d":"15.3"},{"v":14.814000000000002,"d":"14.8"},{"v":14.396,"d":"14.4"},{"v":14.016000000000002,"d":"14.0"},{"v":13.712000000000002,"d":"13.7"},{"v":13.484000000000002,"d":"13.5"},{"v":13.104000000000003,"d":"13.1"},{"v":12.952000000000002,"d":"13.0"},{"v":12.838000000000001,"d":"12.8"},12.8,{"v":12.876000000000001,"d":"12.9"},{"v":13.066000000000003,"d":"13.1"},{"v":13.408000000000001,"d":"13.4"},{"v":13.902000000000001,"d":"13.9"},{"v":14.472000000000001,"d":"14.5"},{"v":15.118000000000002,"d":"15.1"},{"v":15.726,"d":"15.7"},{"v":16.182000000000002,"d":"16.2"},{"v":16.486,"d":"16.5"},{"v":103.23199999999997,"d":"103.2"}]
{"$rows_left_out":208}